{"text_format":"1","workbook":"xlsx","n_sheets":5,"sheets":["Instructions","Multiple Zone","100% OA","Single Zone","Summary"],"not_rendered":{"charts":0,"images":1,"macros":1,"external_links":0,"defined_names":31,"comments":3,"pivot_tables":0},"unopened":[],"bounds":{"document_bytes":16777216,"sheet_cells":100000,"rows_first":2000,"rows_last":500,"rows_between":2000,"halvings":0,"cell_chars":16384,"cell_head_chars":4096},"cells_cut":0,"cells_raw":0,"read":"whole","date_system":"1900"}

{"sheet":"Instructions","index":0,"n_rows":309,"n_cols":17,"rows_kept":309,"cut":false,"hidden":false,"merged":[[113,2,113,5],[73,2,74,5],[73,6,73,7],[73,8,73,9],[73,10,74,10],[58,2,58,4],[45,5,45,9],[46,5,46,9],[47,5,47,9],[48,5,48,9],[49,5,49,9],[55,2,55,4],[50,5,50,9],[51,5,51,9],[56,2,56,4],[57,2,57,4],[43,5,43,9],[44,5,44,9],[2,4,2,10],[5,4,5,7],[28,4,28,10],[35,4,35,10],[32,4,32,10],[21,4,21,8],[73,13,74,13],[41,2,41,4],[41,5,41,9],[42,2,42,4],[43,2,43,4],[44,2,44,4],[45,2,45,4],[46,2,46,4],[47,2,47,4],[48,2,48,4],[49,2,49,4],[50,2,50,4],[51,2,51,4],[67,2,67,9],[59,2,59,4],[42,5,42,9],[68,2,68,9],[69,2,69,9],[60,2,60,4],[61,2,61,4],[65,2,65,9],[66,2,66,9]]}
[]
[]
[null,null,null,null,"Minimum Indoor Air Quality Performance Calculator\nLEED 2009, v4, and v4.1 EQ Prerequisite Minimum Indoor Air Quality Performance"]
[]
[null,null,null,null,"Step 1."]
[null,null,null,null,"Enable macros."]
[null,null,null,null,"Note: This calculator is for use with Excel for Mac 2011 and Excel 2007 or later."]
[]
[null,null,null,null,"Step 2. "]
[null,null,null,null,"Unit of measurement",null,null,null,null,null,"IP units"]
[null,null,null,null,"Note: This selection must match the unit of measurement chosen during project registration."]
[]
[null,null,null,null,"Step 3. "]
[null,null,null,null,"LEED rating system version",null,null,null,null,null,"LEED v4.1"]
[null,null,null,null,"Note: This selection must match project registration."]
{"$rows_left_out":295}
{"sheet":"Multiple Zone","index":1,"n_rows":37,"n_cols":36,"rows_kept":37,"cut":false,"hidden":true,"merged":[[9,10,10,10],[9,1,11,1],[9,2,11,3],[9,5,11,5],[15,2,15,3],[9,9,10,9],[13,2,13,3],[28,1,28,3],[5,1,5,2],[6,1,6,2],[12,2,12,3],[14,2,14,3],[7,1,7,2]]}
[]
[null,"Multiple zone",null,null,null,null,null,null,null,null,null,null,null,null,null,null,null,null,null,null,null,null,null,null,null,"Floor area","Population","Rp","Ra","D","Ez average","Ev","Vps","Xs","Required Vot","Actual"]
[null,{"$f":"REPLACE(CELL(\"filename\",A1),1,FIND(\"]\",CELL(\"filename\",A1)),\"\")","v":"Multiple Zone"},null,null,null,null,null,null,null,null,null,null,null,null,null,null,null,null,null,null,null,null,null,null,null,{"$f":"Area","v":0},{"$f":"$E$20","v":0},{"$f":"IFERROR(IF(Allzones=\"Yes\",(SUM($J14:$J16)/SUM($G14:$G16)),$E$23),0)","v":0},{"$f":"IFERROR(IF(Allzones=\"Yes\",(SUM($K14:$K16)/Area),$E$24),0)","v":0},{"$f":"$E$22","v":0},{"$f":"IFERROR(AVERAGEIF($M$14:$M$16,\"<>0\"),0)","v":0},{"$f":"Ev","v":0},{"$f":"Airflow_cz","v":0},{"$f":"$E$27","v":0},{"$f":"ROUND(E35,0)","v":0},{"$f":"ROUND(E37,0)","v":0}]
[]
[null,"Show simple view",null,null,null,null,null,null,null,null,null,null,null,null,null,null,null,null,null,null,null,null,null,null,false]
[null,"System name and number",null,{"$f":"B3","v":"Multiple Zone"}]
[null,"Condition analyzed (impacts Ez, Vdz, Vpz and Vps)"]
[null,"All zones are included in the VRP calculation"]
[]
[null,"Zone Name \nand Number","Occupancy \nCategory",null,"Zone \nFloor Area","Are you using default value for zone population?","Zone \nPopulation","People \nOutdoor \nAir Rate ","Area\nOutdoor\nAir Rate","Breathing \nZone Outdoor Airflow\n(people related portion)","Breathing\nZone Outdoor\nAirflow\n(area related portion)","Breathing \nZone Outdoor Airflow","Zone Air Distribution Effectiveness","Zone \nOutdoor \nAirflow","Zone \nDischarge Airflow","Zone \nPrimary \nAirflow","Primary Outdoor Air Fraction","Zone Secondary Recirculation Fraction","Zone Primary Air Fraction","Supply Air Fraction","Mixed Air Fraction","Outdoor Air Fraction","Zone Ventilation Efficiency (Appendix A)",null,"Default Pz","Nondefault\nPz","Occupant Density","Zone name for critical zone lookup"]
[null,null,null,null,"Az",null,"Pz","Rp","Ra",null,null,"Vbz","Ez","Voz","Vdz","Vpz","Zpz","Er","Ep","Fa","Fb","Fc","Evz"]
[null,null,null,null,{"$f":"IF(Instructions!$N$169=1,\"(sq ft)\",\"(sq m)\")","v":"(sq ft)"},null,"(people)",{"$f":"IF(Instructions!$N$169=1,Instructions!$G$75,Instructions!$H$75)","v":"(cfm per person)"},{"$f":"IF(Instructions!$N$169=1,Instructions!$I$75,Instructions!$J$75)","v":"(cfm per sq ft) "},{"$f":"IF(Instructions!$N$169=1,\"(cfm)\",\"(l/s)\")","v":"(cfm)"},{"$f":"IF(Instructions!$N$169=1,\"(cfm)\",\"(l/s)\")","v":"(cfm)"},{"$f":"IF(Instructions!$N$169=1,\"(cfm)\",\"(l/s)\")","v":"(cfm)"},null,{"$f":"IF(Instructions!$N$169=1,\"(cfm)\",\"(l/s)\")","v":"(cfm)"},{"$f":"IF(Instructions!$N$169=1,\"(cfm)\",\"(l/s)\")","v":"(cfm)"},{"$f":"IF(Instructions!$N$169=1,\"(cfm)\",\"(l/s)\")","v":"(cfm)"},null,null,null,null,null,null,null,null,null,null,{"$f":"IF(Instructions!$N$169=1,\"(occupants per 1,000 sq ft)\",\"(occupants per 100 sq m)\")","v":"(occupants per 1,000 sq ft)"}]
["A",null,null,null,null,null,null,null,null,"Rp Pz","Ra Az",{"$f":"IF(I_15,\"(Rp Pz + Ra Az)*1.15\",IF(I_30,\"(Rp Pz + Ra Az)*1.3\",IF(I_No,\"(Rp Pz + Ra Az)\",IF(AND(Instructions!K14<>\"LEED v4.1\",credit=1),\"(Rp Pz + Ra Az)*1.3\",\"(Rp Pz + Ra Az)\"))))","v":"(Rp Pz + Ra Az)"},null,"Vbz / Ez",null,null,"Voz / Vpz",null,"Vpz/Vdz","Ep + (1-Ep) Er","Ep","1-(1-Ez)(1-Er)(1-Ep)","(Fa+Xs * Fb-Zpz *Ep*Fc)/Fa"]
[{"$f":"IF(C14=0,0,0)","v":0},null,null,null,null,null,null,{"$f":"IFERROR(IF(Instructions!$N$169=1,VLOOKUP(C14,Instructions!$C$76:$K$160,5,FALSE),VLOOKUP(C14,Instructions!$C$76:$K$160,6,FALSE)),0)","v":0},{"$f":"IFERROR(IF(Instructions!$N$169=1,VLOOKUP(C14,Instructions!$C$76:$K$160,7,FALSE),VLOOKUP(C14,Instructions!$C$76:$K$160,8,FALSE)),0)","v":0},{"$f":"TRUNC(IFERROR(H14*G14,0),2)","v":0},{"$f":"TRUNC(IFERROR(I14*E14,0),2)","v":0},{"$f":"TRUNC(IFERROR(IF(I_15,SUM(J14:K14)*1.15,IF(I_30,SUM(J14:K14)*1.3,IF(I_No,SUM(J14:K14),IF(AND(Instructions!K14<>\"LEED v4.1\",credit=1),SUM(J14:K14)*1.3,SUM(J14:K14))))),0),2)","v":0},null,{"$f":"IFERROR(L14/M14,0)","v":0},null,null,{"$f":"IFERROR(ROUND(N14/P14,2),0)","v":0},null,{"$f":"IFERROR($P14/$O14,0)","v":0},{"$f":"TRUNC(IFERROR(S14+(1-S14)*R14,0),2)","v":0},{"$f":"TRUNC(S14,2)","v":0},{"$f":"TRUNC(IFERROR(1-(1-M14)*(1-R14)*(1-S14),0),2)","v":0},{"$f":"TRUNC(IFERROR(IF($E$27>0,(T14+$E$27 * U14-Q14 * S14 * V14)/T14,0),0),2)","v":0},null,{"$f":"IFERROR(IF(Instructions!$N$169=1,($AA14/1000)*$E14,($AA14/100)*$E14),0)","v":0},null,{"$f":"IFERROR(VLOOKUP($C14,Instructions!$C$76:$K$160,9,FALSE),0)","v":0},{"$f":"B14","v":0}]
[{"$f":"IF(C15=0,0,0)","v":0},null,null,null,null,null,null,{"$f":"IFERROR(IF(Instructions!$N$169=1,VLOOKUP(C15,Instructions!$C$76:$K$160,5,FALSE),VLOOKUP(C15,Instructions!$C$76:$K$160,6,FALSE)),0)","v":0},{"$f":"IFERROR(IF(Instructions!$N$169=1,VLOOKUP(C15,Instructions!$C$76:$K$160,7,FALSE),VLOOKUP(C15,Instructions!$C$76:$K$160,8,FALSE)),0)","v":0},{"$f":"TRUNC(IFERROR(H15*G15,0),2)","v":0},{"$f":"TRUNC(IFERROR(I15*E15,0),2)","v":0},{"$f":"TRUNC(IFERROR(IF(I_15,SUM(J15:K15)*1.15,IF(I_30,SUM(J15:K15)*1.3,IF(I_No,SUM(J15:K15),IF(AND(I_v4.1,credit=1),SUM(J15:K15)*1.3,SUM(J15:K15))))),0),2)","v":0},null,0,null,null,{"$f":"IFERROR(ROUND(N15/P15,2),0)","v":0},null,{"$f":"IFERROR($P15/$O15,0)","v":0},{"$f":"TRUNC(IFERROR(S15+(1-S15)*R15,0),2)","v":0},{"$f":"TRUNC(S15,2)","v":0},{"$f":"TRUNC(IFERROR(1-(1-M15)*(1-R15)*(1-S15),0),2)","v":0},{"$f":"TRUNC(IFERROR(IF($E$27>0,(T15+$E$27 * U15-Q15 * S15 * V15)/T15,0),0),2)","v":0},null,{"$f":"IFERROR(IF(Instructions!$N$169=1,($AA15/1000)*$E15,($AA15/100)*$E15),0)","v":0},null,{"$f":"IFERROR(VLOOKUP($C15,Instructions!$C$76:$K$160,9,FALSE),0)","v":0},{"$f":"B15","v":0}]
{"$rows_left_out":23}
{"sheet":"100% OA","index":2,"n_rows":23,"n_cols":41,"rows_kept":23,"cut":false,"hidden":true,"merged":[[12,2,12,3],[8,1,10,1],[8,5,10,5],[15,2,15,3],[14,2,14,3],[13,2,13,3],[8,9,9,9],[8,10,9,10],[8,15,11,15],[8,17,10,17],[8,2,10,3],[11,2,11,3],[8,16,11,16]]}
[]
[null,"100% Outdoor air",null,null,null,null,null,null,null,null,null,null,null,null,null,">>>>",">>>>",">>>>",">>>>",">>>>",">>>>",">>>>",">>>>",">>>>",">>>>","Floor area","Population","Rp","Ra","D","Ez average","Ev","Vps","Xs","Required Vot","Actual"]
[null,{"$f":"REPLACE(CELL(\"filename\",A1),1,FIND(\"]\",CELL(\"filename\",A1)),\"\")","v":"100% OA"},null,null,null,null,null,null,null,null,null,null,null,null,null,null,null,null,null,null,null,null,null,null,null,{"$f":"$E$19","v":0},{"$f":"$E$20","v":0},{"$f":"IFERROR(SUM($J$13:$J$16)/$E$20,0)","v":0},{"$f":"IFERROR(SUM($K$13:$K$16)/$E$19,0)","v":0},"n/a",{"$f":"IFERROR(AVERAGEIF($M$13:$M$16,\"<>0\"),0)","v":0},"n/a","n/a","n/a",{"$f":"ROUND($E$21,0)","v":0},{"$f":"ROUND($E$23,0)","v":0}]
[]
[null,"Show simple view",null,null,null,null,null,null,null,null,null,null,null,null,null,false]
[null,"System name and number",null,{"$f":"B3","v":"100% OA"}]
[null,"Condition analyzed (impacts Ez)",null,null,null,null,null,null,null,null,null,null,null,null,null,null,null,null,null,null,null,null,null,null,null,null,null,null,null,null,null,null,null,null,null,null,null,null,{"$f":"COUNTIF($AL13:$AL16,\"No\")","v":0},{"$f":"SUM(AM7-0)","v":0},{"$f":"IF(AN7=0,\"Yes\",\"No\")","v":"Yes"}]
[]
[null,"Zone Name \nand Number","Occupancy\nCategory",null,"Zone \nFloor Area","Are you using default value for zone population?","Zone\nPopulation","People\nOutdoor \nAir Rate","Area\nOutdoor \nAir Rate","Breathing \nZone Outdoor Airflow\n(people related portion)","Breathing\nZone Outdoor\nAirflow\n(area related portion)","Breathing \nZone Outdoor Airflow","Zone Air Distribution Effectiveness","Zone \nOutdoor \nAirflow","Zone \nOutdoor \nAirflow Provided","Default Pz","Default Pz","Occupant Density"]
[null,null,null,null,"Az",null,"Pz","Rp","Ra",null,null,"Vbz","Ez","Voz","(measured or design)"]
["B",null,null,null,{"$f":"IF(Instructions!$N$169=1,\"(sq ft)\",\"(sq m)\")","v":"(sq ft)"},null,"(people)",{"$f":"IF(Instructions!$N$169=1,Instructions!$G$75,Instructions!$H$75)","v":"(cfm per person)"},{"$f":"IF(Instructions!$N$169=1,Instructions!$I$75,Instructions!$J$75)","v":"(cfm per sq ft) "},{"$f":"IF(Instructions!$N$169=1,\"(cfm)\",\"(l/s)\")","v":"(cfm)"},{"$f":"IF(Instructions!$N$169=1,\"(cfm)\",\"(l/s)\")","v":"(cfm)"},{"$f":"IF(Instructions!$N$169=1,\"(cfm)\",\"(l/s)\")","v":"(cfm)"},null,{"$f":"IF(Instructions!$N$169=1,\"(cfm)\",\"(l/s)\")","v":"(cfm)"},{"$f":"IF(Instructions!$N$169=1,\"(cfm)\",\"()\")","v":"(cfm)"}]
["A",null,null,null,null,null,null,null,null,"Rp Pz","Ra Az",{"$f":"IF(I_15,\"(Rp Pz + Ra Az)*1.15\",IF(I_30,\"(Rp Pz + Ra Az)*1.3\",IF(I_No,\"(Rp Pz + Ra Az)\",IF(AND(Instructions!K14<>\"LEED v4.1\",credit=1),\"(Rp Pz + Ra Az)*1.3\",\"(Rp Pz + Ra Az)\"))))","v":"(Rp Pz + Ra Az)"},null,"Vbz / Ez",null,null,null,{"$f":"IF(Instructions!N169=1,\"(occupants per 1,000 sq ft)\",\"(occupants per 100 sq m)\")","v":"(occupants per 1,000 sq ft)"}]
[{"$f":"IF(C13=0,0,0)","v":0},null,null,null,null,null,null,{"$f":"IFERROR(IF(Instructions!$N$169=1,VLOOKUP(C13,Instructions!$C$76:$K$160,5,FALSE),VLOOKUP(C13,Instructions!$C$76:$K$160,6,FALSE)),0)","v":0},{"$f":"TRUNC(IFERROR(IF(Instructions!$N$169=1,VLOOKUP(C13,Instructions!$C$76:$K$160,7,FALSE),VLOOKUP(C13,Instructions!$C$76:$K$160,8,FALSE)),0),2)","v":0},{"$f":"TRUNC(H13*G13,2)","v":0},{"$f":"TRUNC(I13*E13,2)","v":0},{"$f":"TRUNC(IF(I_15,(J13+K13)*1.15,IF(I_30,(J13+K13)*1.3,IF(I_No,(J13+K13),IF(AND(I_v4.1,credit=1),(J13+K13)*1.3,(J13+K13))))),2)","v":0},null,{"$f":"TRUNC(IFERROR(L13/M13,0),2)","v":0},null,{"$f":"IFERROR(IF(Instructions!$N$169=1,($R13/1000)*$E13,($R13/100)*$E13),0)","v":0},null,{"$f":"IFERROR(VLOOKUP($C13,Instructions!$C$76:$K$160,9,FALSE),0)","v":0},null,null,null,null,null,null,null,null,null,null,null,null,null,null,null,null,null,null,null,{"$f":"IF($O13 >=$N13,\"Yes\",\"No\")","v":"Yes"}]
[{"$f":"IF(C14=0,0,0)","v":0},null,null,null,null,null,null,{"$f":"IFERROR(IF(Instructions!$N$169=1,VLOOKUP(C14,Instructions!$C$76:$K$160,5,FALSE),VLOOKUP(C14,Instructions!$C$76:$K$160,6,FALSE)),0)","v":0},{"$f":"TRUNC(IFERROR(IF(Instructions!$N$169=1,VLOOKUP(C14,Instructions!$C$76:$K$160,7,FALSE),VLOOKUP(C14,Instructions!$C$76:$K$160,8,FALSE)),0),2)","v":0},{"$f":"TRUNC(H14*G14,2)","v":0},{"$f":"TRUNC(I14*E14,2)","v":0},{"$f":"TRUNC(IF(I_15,(J14+K14)*1.15,IF(I_30,(J14+K14)*1.3,IF(I_No,(J14+K14),IF(AND(I_v4.1,credit=1),(J14+K14)*1.3,(J14+K14))))),2)","v":0},null,{"$f":"TRUNC(IFERROR(L14/M14,0),2)","v":0},null,{"$f":"IFERROR(IF(Instructions!$N$169=1,($R14/1000)*$E14,($R14/100)*$E14),0)","v":0},null,{"$f":"IFERROR(VLOOKUP($C14,Instructions!$C$76:$K$160,9,FALSE),0)","v":0},null,null,null,null,null,null,null,null,null,null,null,null,null,null,null,null,null,null,null,{"$f":"IF($O14 >=$N14,\"Yes\",\"No\")","v":"Yes"}]
[{"$f":"IF(C15=0,0,0)","v":0},null,null,null,null,null,null,{"$f":"IFERROR(IF(Instructions!$N$169=1,VLOOKUP(C15,Instructions!$C$76:$K$160,5,FALSE),VLOOKUP(C15,Instructions!$C$76:$K$160,6,FALSE)),0)","v":0},{"$f":"TRUNC(IFERROR(IF(Instructions!$N$169=1,VLOOKUP(C15,Instructions!$C$76:$K$160,7,FALSE),VLOOKUP(C15,Instructions!$C$76:$K$160,8,FALSE)),0),2)","v":0},{"$f":"TRUNC(H15*G15,2)","v":0},{"$f":"TRUNC(I15*E15,2)","v":0},{"$f":"TRUNC(IF(I_15,(J15+K15)*1.15,IF(I_30,(J15+K15)*1.3,IF(I_No,(J15+K15),IF(AND(I_v4.1,credit=1),(J15+K15)*1.3,(J15+K15))))),2)","v":0},null,{"$f":"TRUNC(IFERROR(L15/M15,0),2)","v":0},null,{"$f":"IFERROR(IF(Instructions!$N$169=1,($R15/1000)*$E15,($R15/100)*$E15),0)","v":0},null,{"$f":"IFERROR(VLOOKUP($C15,Instructions!$C$76:$K$160,9,FALSE),0)","v":0},null,null,null,null,null,null,null,null,null,null,null,null,null,null,null,null,null,null,null,{"$f":"IF($O15 >=$N15,\"Yes\",\"No\")","v":"Yes"}]
{"$rows_left_out":9}
{"sheet":"Single Zone","index":3,"n_rows":13,"n_cols":17,"rows_kept":13,"cut":false,"hidden":true,"merged":[[6,14,9,14],[6,16,7,16],[8,16,9,16],[6,1,8,1],[6,2,8,2],[6,3,8,3],[6,12,7,12],[6,5,8,5],[6,15,9,15]]}
[]
[null,"Single zone"]
[null,"Single Zone"]
[]
[null,"Show simple view",null,null,null,null,null,null,null,null,null,null,null,null,false]
[]
[null,"System Name \nand Number","Condition\nAnalyzed (impacts Ez)","Occupancy \nCategory ","Zone \nFloor Area","Are you using default value for zone population?","Zone \nPopulation","People \nOutdoor \nAir Rate","Area\nOutdoor\nAir Rate","Breathing \nZone Outdoor Airflow","Zone Air Distribution Effectiveness","Zone \nOutdoor \nAirflow","Outdoor air intake flow provided (measured or design)",null,"Default Pz","Nondefault\nPz","Occupant Density"]
[null,null,null,null,"Az",null,"Pz","Rp","Ra","Vbz","Ez","Voz"]
["B",null,null,null,{"$f":"IF(Instructions!$N$169=1,\"(sq ft)\",\"(sq m)\")","v":"(sq ft)"},null,"people",{"$f":"IF(Instructions!$N$169=1,Instructions!$G$75,Instructions!$H$75)","v":"(cfm per person)"},{"$f":"IF(Instructions!$N$169=1,Instructions!$I$75,Instructions!$J$75)","v":"(cfm per sq ft) "},{"$f":"IF(Instructions!$N$169=1,\"(cfm)\",\"(l/s)\")","v":"(cfm)"},null,{"$f":"IF(Instructions!$N$169=1,\"(cfm)\",\"(l/s)\")","v":"(cfm)"},{"$f":"IF(Instructions!$N$169=1,\"(cfm)\",\"(l/s)\")","v":"(cfm)"},null,null,null,{"$f":"IF(Instructions!N169=1,\"Occupants \nper \n1,000 sq ft\",\"Occupants \nper \n100 sq m\")","v":"Occupants \nper \n1,000 sq ft"}]
[null,null,null,null,null,null,null,null,null,{"$f":"IF(I_15,\"(Rp Pz + Ra Az)*1.15\",IF(I_30,\"(Rp Pz + Ra Az)*1.3\",IF(I_No,\"(Rp Pz + Ra Az)\",IF(AND(Instructions!K14<>\"LEED v4.1\",credit=1),\"(Rp Pz + Ra Az)*1.3\",\"(Rp Pz + Ra Az)\"))))","v":"(Rp Pz + Ra Az)"},null,"Vbz / Ez"]
[null,"HIDDEN SPACER FOR SUMMARY"]
[{"$f":"IF(B12=0,0,0)","v":0},null,null,null,null,null,null,{"$f":"IFERROR(IF(Instructions!$N$169=1,VLOOKUP(D12,Instructions!$C$76:$K$160,5,FALSE),VLOOKUP(D12,Instructions!$C$76:$K$160,6,FALSE)),0)","v":0},{"$f":"IFERROR(IF(Instructions!$N$169=1,VLOOKUP(D12,Instructions!$C$76:$K$160,7,FALSE),VLOOKUP(D12,Instructions!$C$76:$K$160,8,FALSE)),0)","v":0},{"$f":"TRUNC(IF(I_15,((I12*E12)+(H12*G12))*1.15,IF(I_30,((I12*E12)+(H12*G12))*1.3,IF(I_No,((I12*E12)+(H12*G12)),IF(AND(Instructions!K14<>\"LEED v4.1\",credit=1),((I12*E12)+(H12*G12))*1.3,((I12*E12)+(H12*G12)))))),2)","v":0},null,{"$f":"IFERROR(J12/K12,0)","v":0},null,null,{"$f":"IFERROR(IF(Instructions!$N$169=1,($Q12/1000)*$E12,($Q12/100)*$E12),0)","v":0},null,{"$f":"IFERROR(VLOOKUP($D12,Instructions!$C$76:$K$160,9,FALSE),0)","v":0}]
[{"$f":"IF(B13=0,0,0)","v":0},null,null,null,null,null,null,{"$f":"IFERROR(IF(Instructions!$N$169=1,VLOOKUP(D13,Instructions!$C$76:$K$160,5,FALSE),VLOOKUP(D13,Instructions!$C$76:$K$160,6,FALSE)),0)","v":0},{"$f":"IFERROR(IF(Instructions!$N$169=1,VLOOKUP(D13,Instructions!$C$76:$K$160,7,FALSE),VLOOKUP(D13,Instructions!$C$76:$K$160,8,FALSE)),0)","v":0},{"$f":"TRUNC(IF(I_15,((I13*E13)+(H13*G13))*1.15,IF(I_30,((I13*E13)+(H13*G13))*1.3,IF(I_No,((I13*E13)+(H13*G13)),IF(AND(Instructions!K14<>\"LEED v4.1\",credit=1),((I13*E13)+(H13*G13))*1.3,((I13*E13)+(H13*G13)))))),2)","v":0},null,{"$f":"IFERROR(J13/K13,0)","v":0},null,null,{"$f":"IFERROR(IF(Instructions!$N$169=1,($Q13/1000)*$E13,($Q13/100)*$E13),0)","v":0},null,{"$f":"IFERROR(VLOOKUP($D13,Instructions!$C$76:$K$160,9,FALSE),0)","v":0}]

{"sheet":"Summary","index":4,"n_rows":21,"n_cols":22,"rows_kept":21,"cut":false,"hidden":false,"merged":[[7,19,9,19],[7,14,9,14],[7,15,9,15],[7,16,9,16],[7,18,9,18],[7,10,8,10],[7,11,9,11],[20,3,20,6],[7,3,9,3],[7,4,9,4],[7,5,9,5],[7,6,9,6]]}
[]
[null,null,1]
[null,null,1,"Summary"]
[null,null,1,"Note: All information on this tab is READ-ONLY. To edit, see the previous tab(s). "]
[null,null,1,null,null,null,null,null,null,null,null,null,null,null,null,null,null,null,null,null,null,true]
[null,null,1,null,"Show simple view"]
[null,null,1]
[null,null,1,"System Name \nand Number","System \nType","All zones included \nin the VRP calculation?","Condition\nAnalyzed","System \nFloor Area","System Population",{"$f":"IF(I_15,\"Outdoor Air Intake Flow (15% above 62.1 requirement)\",IF(I_30,\"Outdoor Air Intake Flow (30% above 62.1 requirement)\",IF(I_No,\"Outdoor Air Intake Flow (required by 62.1)\",IF(AND(Instructions!K14<>\"LEED v4.1\",credit=1),\"Outdoor Air Intake Flow (30% above 62.1 requirement)\",\"Outdoor Air Intake Flow (required by 62.1)\"))))","v":"Outdoor Air Intake Flow (required by 62.1)"},"Outdoor Air Intake Flow Provided\n(measured or design)","Outdoor air \nintake flow provided \nmeets or exceeds Vot?","People \nOutdoor \nAir Rate for System","Area\nOutdoor\nAir Rate for System","Occupant Diversity\nD","Average \nZone Air Distribution Effectiveness\nEz average","Ventilation\nEfficiency\nEv","System \nPrimary Airflow \n(at condition analyzed)","Average Outdoor Air Fraction\nXs","Zone outdoor airflow provided meets or exceeds Voz for all zones?"]
["B",null,null,null,null,null,null,"As","Ps","Vot",null,null,"Rp system","Ra system",null,null,null,"Vps"]
[null,null,1,null,null,null,null,{"$f":"IF(Instructions!$N$169=2,\"(sq m)\",\"(sq ft)\")","v":"(sq ft)"},"(people)",{"$f":"IF(Instructions!$N$169=2,\"(L/s)\",\"(cfm)\")","v":"(cfm)"},{"$f":"IF(Instructions!$N$169=2,\"(L/s)\",\"(cfm)\")","v":"(cfm)"},null,{"$f":"IF(Instructions!$N$169=1,Instructions!$G$75,Instructions!$H$75)","v":"(cfm per person)"},{"$f":"IF(Instructions!$N$169=1,Instructions!$I$75,Instructions!$J$75)","v":"(cfm per sq ft) "},null,null,null,{"$f":"IF(Instructions!$N$169=1,\"(cfm)\",\"(l/s)\")","v":"(cfm)"}]
[null,null,null,"Single Zone Systems"]
[null,null,null,{"$f":"'Single Zone'!$B12","v":0},{"$f":"'Single Zone'!$B$2","v":"Single zone"},{"$f":"IF(E12=\"Single zone\",\"n/a\",\"\")","v":"n/a"},{"$f":"'Single Zone'!$C12","v":0},{"$f":"'Single Zone'!$E12","v":0},{"$f":"'Single Zone'!G12","v":0},{"$f":"ROUND('Single Zone'!L12,0)","v":0},{"$f":"ROUND('Single Zone'!M12,0)","v":0},{"$f":"IF(AND(K12>0,J12>0,K12>=J12),\"Yes\",\"No\")","v":"No"},{"$f":"'Single Zone'!H12","v":0},{"$f":"'Single Zone'!I12","v":0},{"$f":"IF($E12=\"Single zone\",\"n/a\",\"\")","v":"n/a"},{"$f":"'Single Zone'!K12","v":0},{"$f":"IF($E12=\"Single zone\",\"n/a\",\"\")","v":"n/a"},"n/a","n/a",{"$f":"IF(E12=\"Single zone\",\"n/a\",\"\")","v":"n/a"}]
[null,null,null,{"$f":"'Single Zone'!$B13","v":0},{"$f":"'Single Zone'!$B$2","v":"Single zone"},{"$f":"IF(E13=\"Single zone\",\"n/a\",\"\")","v":"n/a"},{"$f":"'Single Zone'!$C13","v":0},{"$f":"'Single Zone'!$E13","v":0},{"$f":"'Single Zone'!G13","v":0},{"$f":"ROUND('Single Zone'!L13,0)","v":0},{"$f":"ROUND('Single Zone'!M13,0)","v":0},{"$f":"IF(AND(K13>0,J13>0,K13>=J13),\"Yes\",\"No\")","v":"No"},{"$f":"'Single Zone'!H13","v":0},{"$f":"'Single Zone'!I13","v":0},"n/a",{"$f":"'Single Zone'!K13","v":0},"n/a","n/a","n/a",{"$f":"IF(E13=\"Single zone\",\"n/a\",\"\")","v":"n/a"}]
[]
[null,null,null,"Multiple Zone Systems"]
{"$rows_left_out":6}